FailedConsole Output

Started by GitHub push by Johni0702
Building in workspace /var/lib/jenkins/workspace/ProtocolGen
 > git rev-parse --is-inside-work-tree # timeout=10
Fetching changes from the remote Git repository
 > git config remote.origin.url # timeout=10
Fetching upstream changes from
 > git --version # timeout=10
using GIT_SSH to set credentials Default deployment key
 > git -c core.askpass=true fetch --tags --progress +refs/heads/*:refs/remotes/origin/*
 > git rev-parse refs/remotes/origin/1.8^{commit} # timeout=10
 > git rev-parse refs/remotes/origin/origin/1.8^{commit} # timeout=10
Checking out Revision b79709d68dc6b78584f9a373d544880b7275435f (refs/remotes/origin/1.8)
 > git config core.sparsecheckout # timeout=10
 > git checkout -f b79709d68dc6b78584f9a373d544880b7275435f
 > git rev-list bfc5b779d0cce6ef9747f92bdfd519b5c6bac635 # timeout=10
[Gradle] - Launching build.
[ProtocolGen] $ /var/lib/jenkins/workspace/ProtocolGen/gradlew clean build
:processResources UP-TO-DATE
:genPacketSources FAILED

FAILURE: Build failed with an exception.

* Where:
Script '/var/lib/jenkins/workspace/ProtocolGen/generator.gvy' line: 11

* What went wrong:
Execution failed for task ':genPacketSources'.
> /var/lib/jenkins/workspace/ProtocolGen/minecraft-data/enums/protocol.json (No such file or directory)

* Try:
Run with --stacktrace option to get the stack trace. Run with --info or --debug option to get more log output.


Total time: 16.779 secs
Build step 'Invoke Gradle script' changed build result to FAILURE
Build step 'Invoke Gradle script' marked build as failure
Skipped archiving because build is not successful
IRC notifier plugin: Sending notification to: #jbot-ci
Finished: FAILURE